{"text_format":"1","workbook":"xlsx","n_sheets":3,"sheets":["Worksheet","Planilha1","Teste"],"not_rendered":{"charts":0,"images":0,"macros":1,"external_links":0,"defined_names":0,"comments":0,"pivot_tables":0},"unopened":[],"bounds":{"document_bytes":16777216,"sheet_cells":100000,"rows_first":2000,"rows_last":500,"rows_between":2000,"halvings":0,"cell_chars":16384,"cell_head_chars":4096},"cells_cut":0,"cells_raw":0,"read":"whole","date_system":"1900"}

{"sheet":"Worksheet","index":0,"n_rows":145,"n_cols":48,"rows_kept":145,"cut":false,"hidden":true,"merged":[]}
["SCA - Relatório de Candidatos ENA 2019"]
["Gerado em 26/09/2018 12:18:51"]
[]
[]
["ID","CPF","Nome","E-mail","Data Nasc","Nasc UF","Nasc Município","Nasc País","Sexo","Estado Civil","Tipo Endereço","Logradouro","Número","Compl","Bairro","UF","Município","CEP","Te Celular","Tel Resid","tel_comercial","Instituicao","Inst Cidade","Protocolo","emp1_nome","emp1_tipo","emp1_mes_fim","emp1_cidade","emp1_cargo","emp1_mes_ini","emp2_nome","emp2_cidade","emp2_cargo","emp2_tipo","emp2_mes_ini","emp2_mes_fim","curso1_tipo","curso1_nome","curso1_mes_ini","curso1_mes_fim","curso1_situacao","curso2_tipo","curso2_nome","curso2_mes_ini","curso2_mes_fim","curso2_situacao","Nota","Situação"]
[8398,"884.683.302-30","ADAM PEREIRA MIRANDA","adam.sandler777@gmail.com","14/01/1986 00:00:00","RO","Guajará-Mirim","BRASIL","M",5,1,"Av: Pedro Eleuterio Ferreira ",1093,null,"Tamandaré","RO","Guajará-Mirim",76850000,"(69) 99207-2053","(69)35413479",null,"UNIR","Porto Velho - RO",null,"EEEFM SIMON BOLIVAR","Escola da Rede Estadual",null,"Guajará- Mirim - RO","Professor","03/2017",null,null,null,"---",null,null,1,"Matemática","02/2005","12/2008",1,null,null,null,null,null,10,{"$f":"IF(AU6>=9,\"Aprovado\",\"Desclassificado\")","v":"Aprovado"}]
[24075,"221.359.602-68","ADÃO GERALDO COLOMBO","ageraldoc@yahoo.com.br","09/03/1965 00:00:00","RO","Porto Velho","BRASIL","M",1,1,"RUA DO URANIO",3755,"CONJUNTO MARECHAL RONDON","FLODOALDO PONTES PINTO","RO","Porto Velho",76820666,"(06) 99916-5464","06932254413",null,"UNIR","Porto Velho - RO",null,null,"Outro tipo de estabelecimento","08/2017","PORTO VELHO - RO","Auditor Fiscal","06/1996",null,null,null,"---",null,null,1,"MATEMATICA","03/1988","08/1993",1,null,null,null,null,null,13,{"$f":"IF(AU7>=9,\"Aprovado\",\"Desclassificado\")","v":"Aprovado"}]
[20900,"616.927.272-49","ADEMILSON ALVES MARTINS","ademilsonmartins1234@gmail.com","04/01/1978 00:00:00","RO","jí - Paraná","BRASIL","M",6,1,"Rodovia - 470; Lote - 36 R; Gleba - 26","Km - 29","Área - Rural","Zona - Rural","RO","Vale do Paraíso",76923000,"(69) 99231-2679",null,"(69) 3464 - 1446","UNIR","Porto Velho - RO",null,null,"---",null,null,null,null,null,null,null,"---",null,null,null,null,null,null,null,null,null,null,null,null,"AUSENTE","Aprovado"]
[3564,"583.057.182-04","AGNALDO ALMEIDA PEREIRA","agnaldoap@hotmail.com","22/06/1976 00:00:00","RO","Porto Velho","BRASIL","M",1,1,"Rua Tapajós",6142,null,"São Sebastião","RO","Porto Velho",76801638,"(69) 99276-1652",6932215675,null,"UNIR","Porto Velho - RO",null,"GOVERNO DO ESTADO DE RONDONIA","Escola da Rede Estadual",null,"PORTO VELHO - RO","PROFESSOR CLASSE C",null,"E. Me. F Wadih Darwich Zacarias","PORTO VELHO - RO","PROFESSOR","Escola da Rede Municipal",null,null,1,"LICENCIATURA PLENA EM MATEMATICA","01/1998","12/2002",1,3,"metodologia do ensino superior","01/2002","06/2003",1,11,"Aprovado"]
[19754,"026.404.362-60","ALAILSON CARIAS DA SILVA","alailsonsilva2@gmail.com","18/11/1996 00:00:00","RO","Buritis","BRASIL","M",5,1,"Rua Primo Amaral","Nº 2832","Casa Verde","Setor 06","RO","Buritis",76880000,"(69) 99255-3065","(69) 99255-3065","(69) 99255-3065","UNIR","Porto Velho - RO",null,null,"---",null,null,null,null,null,null,null,"---",null,null,null,null,null,null,null,null,null,null,null,null,4,"Desclassificado"]
[958,"632.363.462-72","ALCELIO DA SILVA DOS REIS","alcelio_reis@hotmail.com","03/04/1978 00:00:00","AM","Manaus","BRASIL","M",1,1,"Rua Antônio Vivaldi - de 6523/6524 a 6825/6826",6661,null,"Aponiã","RO","Porto Velho",76824096,"(69) 99232-8567",null,null,"UNIR","Porto Velho - RO",null,"colégio adventista de porto velho","Escola Privada",null,"Porto velho - RO","professor","08/2011",null,null,null,"---",null,null,1,"licenciatura plena em matemática","03/2003","12/2006",1,3,"docência do ensino superior","06/2012","06/2015",1,11,"Aprovado"]
[8796,"613.216.802-87","ALESSANDRO DE SOUSA RODRIGUES","sousa0808@hotmail.com","08/08/1976 00:00:00","RO","Porto Velho","BRASIL","M",3,1,"RUA EDUARDO LIMA E SILVA",2114,null,"FLODOALDO PONTES PINTO","RO","Porto Velho",76820396,"(69) 99277-4415",null,null,"UNIR","Porto Velho - RO",null,"GOVERNO DO ESTADO DE RONDÔNIA","Escola da Rede Estadual",null,"PORTO VELHO - RO","PROFESSOR NÍVEL III","04/1997",null,null,null,"---",null,null,1,"MATEMÁTICA","02/1996","12/1999",1,3,"GESTÃO PÚBLICA","02/2001","12/2001",1,16,"Aprovado"]
[13578,"921.285.052-91","ALEX RODRIGUES DE LIMA","ALEXRODRIGUES_16@HOTMAIL.COM","14/11/1990 00:00:00","RO","Porto Velho","BRASIL","M",5,1,"Rua Bartolomeu Pereira ",3523,null,"Eletronorte","RO","Porto Velho",76808476,"(69) 99202-1385",6932274307,null,"UNIR","Porto Velho - RO",null,"SANTA MARCELINA MARCELLO CÂNDIA","Escola da Rede Estadual",null,"PORTO VELHO - RO","PROFESSOR CLASSE C","02/2015","DOM JOÃO BATISTA COSTA","CANDEIAS DO JAMARI - RO","PROFESSOR MATEMÁTICA 25 HRS","Escola da Rede Municipal","08/2014",null,1,"LICENCIATURA PLENA EM MATEMÁTICA","02/2009","08/2014",1,null,null,null,null,null,15,"Aprovado"]
[500,"920.909.827-72","ALEX SANDRE DE ASSIS GUIMARAES","alex.matematicando@gmail.com","11/02/1967 00:00:00","RJ","Rio de Janeiro","BRASIL","M",1,1,"Rua Carlos Chagas",1751,null,"Conceição","RO","Porto Velho",76808424,"(69) 99983-6005","69 32276005",null,"UNIR","Porto Velho - RO",null,"COLÉGIO TIRADENTES DA POLÍCIA MILITAR DE JACI PARANÁ","Escola da Rede Estadual",null,"PORTO VELHO - RO","PROFESSOR","06/2013",null,null,null,"---",null,null,1,"Matemática","02/2003","06/2006",1,2,"Direito","06/1990","07/1994",1,13,"Aprovado"]
[11693,"902.556.902-15","ALEXANDRO AMÉRICO MACEDO","alexandrotur2010@hotmail.com","11/12/1986 00:00:00","RO","Cacoal","BRASIL","M",5,1,"Rua Professora Maria Lucia da Silva Miller",3665,"Casa","Residencial Parque Alvorada","RO","Cacoal",76961604,"(69) 99609-8845",null,null,"UNIR","Porto Velho - RO",null,"Candido Portinário ","Escola da Rede Municipal",null,"São Miguel - RO","Professor","02/2017","Mario de Andrade","São Miguel - RO","Professor","Escola da Rede Municipal","02/2017",null,1,"Matemática","07/2010","12/2013",1,3,"Ensino da Matemática","09/2012","11/2013",1,6,"Desclassificado"]
[8283,"529.354.002-59","ANA CÁSSIA LADDAGA DIAS ","laddagadias@gmail.com","23/07/1987 00:00:00","AM","Manaus ","BRASIL","F",5,1,"Rua Osório (Cj Rio Guaporé)",2270,"Conjunto guapore","Castanheira","RO","Porto Velho",76811390,"(69) 98123-6893",6932282248,null,"UNIR","Porto Velho - RO",null,null,"---",null,null,null,null,null,null,null,"---",null,null,null,null,null,null,null,null,null,null,null,null,6,"Desclassificado"]
[22308,"911.618.602-82","ANDERSON DE OLIVEIRA FELIX","anderson.ofelix@gmail.com","23/06/1989 00:00:00","RO","Porto Velho","BRASIL","M",5,1,"avenida Guaporé",6100,"apt D202","rio madeira","RO","Porto Velho",76821430,"(69) 99258-0990",null,null,"UNIR","Porto Velho - RO",null,null,"---",null,null,null,null,null,null,null,"---",null,null,null,null,null,null,null,null,null,null,null,null,"AUSENTE","Aprovado"]
[9737,"695.949.102-91","ANGELA MARIA SANTOS DE SOUZA","angela_jipa@hotmail.com","29/09/1981 00:00:00","RO","Ji-Paraná","BRASIL","F",1,1,"Avenida Lupércio Prado Dorofé",810,"casa","Parque Fortaleza","RO","Cacoal",76961772,"(69) 99244-0960",null,null,"UNIR","Porto Velho - RO",null,"E.M.E.I.E.F. Monteiro Lobato","Escola da Rede Municipal",null,"Cacoal - RO","Professora de Matemática","09/2008",null,null,null,"---",null,null,1,"Matemática","02/2000","12/2003",1,3,"Metodologia e Didática do Ensino Superior","03/2008","11/2008",1,18,"Aprovado"]
[5192,"947.562.102-44","ANIELA OLIVA PEREIRA LOBO","anielalobo@hotmail.com","15/05/1989 00:00:00","RO","Porto Velho","BRASIL","F",5,1,"Rua Quintino Bocaiúva - de 1231/1232 a 1578/1579",1518,null,"Olaria","RO","Porto Velho",76801250,"(69) 99989-7789",null,null,"UNIR","Porto Velho - RO",null,null,"---",null,null,null,null,null,null,null,"---",null,null,null,null,null,null,null,null,null,null,null,null,13,"Aprovado"]
[6886,"013.277.492-54","ANNE CRISTINY BORGES","anne-cristiny@hotmail.com","28/02/1994 00:00:00","RO","Ji-Paraná","BRASIL","F",5,1,"Rua Rio Xingu - até 1379/1380",603,null,"Dom Bosco","RO","Ji-Paraná",76907806,"(69) 98141-7634",null,null,"UNIR","Porto Velho - RO",null,"E.E.E.F Silvio Micheluzzi","Escola da Rede Estadual","02/2017","Ji-Paraná - RO","Monitora de matemática - Estágio Remunerado","02/2016",null,null,null,"---",null,null,1,"Matemática","09/2013","07/2017",1,null,null,null,null,null,15,"Aprovado"]
[21677,"853.841.272-87","ANTENOR RAFAEL BISCONSIN","arbisconsin@hotmail.com","30/04/1986 00:00:00","RO","Porto Velho","BRASIL","M",1,1,"RUA PARTICULAR",4676,null,"RIO MADEIRA","RO","Porto Velho",76821494,"(69) 99270-1001",null,null,"UNIR","Porto Velho - RO",null,"TRIBUNAL DE CONTAS DO ESTADO DE RONDONIA","Outro tipo de estabelecimento",null,"PORTO VELHO - RO","AUDITOR DE CONTROLE EXTERNO","02/2010",null,null,null,"---",null,null,2,"CIÊNCIAS ECONÔMICAS","01/2004","12/2009",1,null,null,null,null,null,19,"Aprovado"]
[22418,"561.572.402-10","ANTONIETA DA SILVA BORGES ","borgespw@gmail.com","04/07/1977 00:00:00","AC","Porto Walter","BRASIL","F",2,1,"Rua Doze de dezembro",3422,"apto 02","Cohab","RO","Porto Velho",76807828,"(69) 98432-7833",null,null,"UNIR","Porto Velho - RO",null,null,"---",null,null,null,null,null,null,null,"---",null,null,null,null,null,null,null,null,null,null,null,null,5,"Desclassificado"]
[20797,"654.222.362-20","ANTONIO FRANCISCO GOMES","tonyinfonet@gmail.com","24/02/1977 00:00:00","RO","PORTO VELHO","BRASIL","M",1,1,"RUA GERALDO SIQUEIRA",4325,"CASA","CALADINHO","RO","PORTO VELHO",76808215,"(69) 99258-1566",69322100367,null,"UNIR","Porto Velho - RO",null,null,"---",null,null,null,null,null,null,null,"---",null,null,null,null,null,null,null,null,null,null,null,null,6,"Desclassificado"]
[5852,"020.752.482-30","ARTUR SALVADOR","artursalvador@hotmail.com","07/04/1993 00:00:00","RO","Ji-Paraná","BRASIL","M",5,1,"Rua Veleiro ",6700,null,"Aponiã","RO","Porto Velho",76824100,"(69) 99286-0512",null,null,"UNIR","Porto Velho - RO",null,null,"---",null,null,null,null,null,null,null,"---",null,null,null,null,null,null,null,null,null,null,null,null,6,"Desclassificado"]
[26474,"171.705.832-91","BENITO DA SILVA FRANCO","benithodj@hotmail.com","09/10/1963 00:00:00","PA","Cachoeira do Arari","BRASIL","M",6,1,"RUA GETÚLIO VARGAS",3537,"SUBESQUINA COM PIO XII","SÃO JOÃO BOSCO","RO","Porto Velho",76803742,"(69) 99311-5590",6932230094,"(69)32165741","UNIR","Porto Velho - RO",null,"ESCOLA ESTADUAL DE ENSINO FUNDAMENTAL E MÉDIO GOV. ARAÚJO LIMA (SEDUC-RO)","Escola da Rede Estadual",null,"PORTO VELHO - RO","PROFESSOR","02/1998",null,null,null,"---",null,null,1,"LICENCIATURA PLENA EM MATEMÁTICA","02/1993","12/1997",1,3,"DOCÊNCIA DO ENSINO SUPERIOR","10/2002","01/2004",1,18,"Aprovado"]
[7160,"022.332.622-47","BRUNA RAÍSSA DE OLIVEIRA FALCÃO","bruna.falcao.brof@gmail.com","04/07/1996 00:00:00","RO","Porto Velho","BRASIL","F",5,1,"Clóvis Machado",3450,"CASA","TANCREDO NEVES","RO","Porto Velho",76829482,"(69) 99333-5053",null,null,"UNIR","Porto Velho - RO",null,null,"---",null,null,null,null,null,null,null,"---",null,null,null,null,null,null,null,null,null,null,null,null,10,"Aprovado"]
[17831,"060.323.366-03","BRUNO MARTINS ALEXANDRE","bruno.martins@unir.br","27/04/1982 00:00:00","MG","Sabará","BRASIL","M",5,1,"Avenida José Vieira Caúla",3351,null,"Nova Porto Velho","RO","Porto Velho",76820148,"(69) 99331-0882",null,6921822220,"UNIR","Porto Velho - RO",null,null,"---",null,null,null,null,null,null,null,"---",null,null,null,null,null,null,null,null,null,null,null,null,"AUSENTE","Aprovado"]
[18789,"419.860.162-34","CARLOS ANDRÉ BARBOSA DE JESUS","barbosadejesu@hotmail.com","02/07/1974 00:00:00","RO","Porto Velho","BRASIL","M",1,1,"Rua Paulo Leal ",319,null,"Centro","RO","Porto Velho",76801094,"(69) 9904-9612",6932294836,null,"UNIR","Porto Velho - RO",null,"UNIRON","Outro tipo de estabelecimento",null,"Porto Velho - RO","Professor ","06/2011",null,null,null,"---",null,null,2,"Ciências Econômicas","03/1994","06/2000",1,null,null,null,null,null,"AUSENTE","Aprovado"]
[6161,"729.293.752-72","CARLOS ARLON MOURA NUNES","arlon2212@gmail.com","23/01/1975 00:00:00","RO","Porto Velho","BRASIL","M",1,1,"Rua João Goulart - de 2293/2294 a 2612/2613",2453,"Frente a vila Militar","São Cristóvão","RO","Porto Velho",76804050,"(92) 98442-6835",null,null,"UNIR","Porto Velho - RO",null,null,"---",null,null,null,null,null,null,null,"---",null,null,null,null,null,null,null,null,null,null,null,null,12,"Aprovado"]
[514,"015.038.292-86","CAROLINE LEITE BRAGA","carolineleitebraga@gmail.com","12/02/1994 00:00:00","RO","Porto Velho","BRASIL","F",1,3,"Rua Francisco Dias",2679,"Casa","Lagoinha","RO","Porto Velho",76829720,"(69) 99258-2029",null,null,"UNIR","Porto Velho - RO",null,null,"---",null,null,null,null,null,null,null,"---",null,null,null,null,null,null,null,null,null,null,null,null,10,"Aprovado"]
[2148,"085.280.552-72","CHARLES WILSON MONTEIRO","wilson@unir.br","15/04/1960 00:00:00","AM","Manicoré","BRASIL","M",1,1,"RUA RAIMUNDO CANTUÁRIA",8000,"CASA","TANCREDO NEVES","RO","Porto Velho",76829592,"(69) 99224-6962",null,null,"UNIR","Porto Velho - RO",null,null,"---",null,null,null,null,null,null,null,"---",null,null,null,null,null,null,null,null,null,null,null,null,19,"Aprovado"]
[20328,"029.048.331-02","CHRISTIANE ITO GORSKI","ane.gorski@gmail.com","14/08/1986 00:00:00","RO","PORTO VELHO","BRASIL","F",6,1,"RUA RIO MARMELO",5825,null,"CUNIÃ","RO","PORTO VELHO",76824404,"(69) 99939-2126",6933017147,null,"UNIR","Porto Velho - RO",null,null,"---",null,null,null,null,null,null,null,"---",null,null,null,null,null,null,null,null,null,null,null,null,13,"Aprovado"]
[6332,"326.900.702-78","CICERO JOSÉ DA SILVA ","cicero_prof@live.com","15/08/1969 00:00:00","CE","Mauriti","BRASIL","M",3,1,"Linha 47,5 km 01","S/N","Casa","Zona rural","RO","Alta Floresta D'Oeste",76954000,"(69) 99308-0503",6936412555,6936413924,"UNIR","Porto Velho - RO",null,null,"---",null,null,null,null,null,null,null,"---",null,null,null,null,null,null,null,null,null,null,null,null,"AUSENTE","Aprovado"]
[23408,"747.525.292-20","CLAUDIMAR DA SILVA VIEIRA","clau_mat_23@hotmail.com","21/07/1983 00:00:00","MT","Colíder","BRASIL","M",1,1,"RUA NOVA ESPERANÇA",3841,"CASA","CALADINHO","RO","Porto Velho",76808226,"(69) 99212-0816","(69) 32290767","(69)32114734","UNIR","Porto Velho - RO",null,"JESUS BURLAMAQUI HOSANAH","Escola da Rede Estadual","10/2019","PORTO VELHO - RO","PROFESSOR DE MATEMÁTICA","10/2015",null,null,null,"---",null,null,1,"MATEMÁTICA","04/2003","01/2007",1,null,null,null,null,null,11,"Aprovado"]
[24689,"124.555.983-49","CLAUDIONOR FERNANDES FILHO","claudionor-filho1958@bol.com.br","10/11/1958 00:00:00",null,"porto velho","BRASIL","M",1,1,"rua",2601,"casa","Liberdade","RO","Porto Velho",76803872,"(69) 99307-9695","000000000","00000000","UNIR","Porto Velho - RO",null,null,"---",null,null,null,null,null,null,null,"---",null,null,null,null,null,null,null,null,null,null,null,null,5,"Desclassificado"]
[3965,"659.759.282-49","CLAUDOMICIO DA SILVA SANTOS","aspeafa.agrifamiliar@hotmail.com","14/11/1974 00:00:00","SP","Carapicuíba","BRASIL","M",1,1,"LH 629 KM 85",52,"ZONA RURAL","TARILANDIA","RO","Jaru",76890,"(69) 99383-8461",null,6935261069,"UNIR","Porto Velho - RO",null,"PEDRO VIEIRA DE MELO","Escola da Rede Estadual",null,"TARILANDIA - RO","PROFESSOR","04/2017",null,null,null,"---",null,null,1,"MATEMÁTICA","01/2007","06/2010",1,3,"GESTÃO ESCOLAR","07/2014","11/2015",1,"AUSENTE","Aprovado"]
[21977,"771.055.912-34","CLEISE FRAGA DE ANDRADE","cleisefragadeandrade@gmail.com","27/05/1984 00:00:00","MG","Santana do Manhuaçú","BRASIL","F",5,1,"Rua Toledo - de 355/356 a 647/648",639,"Casa","Jardim dos Migrantes","RO","Ji-Paraná",76900675,"(69) 98411-3724",null,null,"UNIR","Porto Velho - RO",null,"Lauro Benno Prediger","Escola da Rede Estadual",null,"Ji-Paraná - RO","Professora ","07/2010",null,null,null,"---",null,null,3,"Metodologia do ensino superior","07/208","09/2009",1,1,"Matematica","08/2002","12/2006",1,12,"Aprovado"]
[519,"823.319.282-15","CRISTIELLY GLOWASKY","crisglowasky@hotmail.com","16/05/1986 00:00:00","RO","Rolim de Moura","BRASIL","F",6,1,"rua rio madeira",5752,null,"centro","RO","Rolim de Moura",76940000,"(69) 98458-5536",null,6934427373,"UNIR","Porto Velho - RO",null,null,"---",null,null,null,null,null,null,null,"---",null,null,null,null,null,null,null,null,null,null,null,null,"AUSENTE","Aprovado"]
[673,"602.471.852-72","CYRO BENTO DA SILVA","cybs_6@hotmail.com","07/04/1976 00:00:00","AM","Lábrea","BRASIL","M",1,1,"Rua das Mangueiras",1251,null,"Eletronorte","RO","Porto Velho",76808574,"(69) 98403-0563","69 32284545","69 21822185","UNIR","Porto Velho - RO",null,"EEEFM PROFESSOR EDUARDO LIMA E SILVA/ GOVERNO DO ESTADO DE RO","Escola da Rede Estadual","09/2016","PORTO VELHO - RO","PROFESSOR","02/2004",null,null,null,"---",null,null,1,"LICENCIATURA PLENA EM MATEMÁTICA","02/1997","12/2000",1,null,null,null,null,null,12,"Aprovado"]
[21689,"015.343.102-40","DANIELA BISPO DE SOUZA ","danielabispo.2016@hotmail.com","18/01/1993 00:00:00","RO","Alto Paraiso","BRASIL","F",3,1,"Av Benjamim Constant, TV Crisanto Jobim",46,"Apartamento 5 ","Petrópolis ","AM","Manaus ",69000000,"(99) 99355-6577",null,null,"UNIR","Porto Velho - RO",null,null,"---",null,null,null,null,null,null,null,"---",null,null,null,null,null,null,null,null,null,null,null,null,"AUSENTE","Aprovado"]
{"$rows_left_out":106}
{"sheet":"Planilha1","index":1,"n_rows":141,"n_cols":3,"rows_kept":141,"cut":false,"hidden":true,"merged":[]}
["CPF","Nota","Situação"]
["70132437287",3,{"$f":"IF(OR(B2=\"AUSENTE\",B2<9),\"Desclassificado\",\"Aprovado\")","v":"Desclassificado"}]
["47132612115",3,"Desclassificado"]
["83616403200",3,"Desclassificado"]
["02640436260",4,"Desclassificado"]
["56157240210",5,"Desclassificado"]
["12455598349",5,"Desclassificado"]
["00320550214",5,"Desclassificado"]
["57629986220",5,"Desclassificado"]
["90255690215",6,"Desclassificado"]
["52935400259",6,"Desclassificado"]
["65422236220",6,"Desclassificado"]
["02075248230",6,"Desclassificado"]
["59900660234",6,"Desclassificado"]
["00108696200",6,"Desclassificado"]
["77839862268",6,"Desclassificado"]
["82250634220",6,"Desclassificado"]
["28370902200",6,"Desclassificado"]
["19819536200",6,"Desclassificado"]
["02240087226",7,"Desclassificado"]
["91430003200",7,"Desclassificado"]
["38591740297",8,"Desclassificado"]
["54492378987",8,"Desclassificado"]
["32645449204",9,"Aprovado"]
["71832092372",9,"Aprovado"]
["35056347272",9,"Aprovado"]
["85263834268",9,"Aprovado"]
["26354730644",9,"Aprovado"]
["85065293287",9,"Aprovado"]
["93016212234",9,"Aprovado"]
["88468330230",10,"Aprovado"]
["02233262247",10,"Aprovado"]
["01503829286",10,"Aprovado"]
["42271738253",10,{"$f":"IF(OR(B34=\"AUSENTE\",B34<9),\"Desclassificado\",\"Aprovado\")","v":"Aprovado"}]
["90142110230",10,"Aprovado"]
["75197065249",10,"Aprovado"]
["03030738450",10,"Aprovado"]
["86071408253",10,"Aprovado"]
["74385356653",10,"Aprovado"]
["69740887287",10,"Aprovado"]
{"$rows_left_out":102}
{"sheet":"Teste","index":2,"n_rows":7,"n_cols":4,"rows_kept":7,"cut":false,"hidden":false,"merged":[]}
[]
[]
[null,"Digite abaixo  seu CPF (somente números)","Nota","Situação"]
[null,null,{"$f":"IF(B4=\"\",\"\",IFERROR(VLOOKUP($B$4,Planilha1!$A$1:$C$140,2,FALSE),\"cpf não encontrado\"))","v":""},{"$f":"IF(B4=\"\",\"\",IFERROR(VLOOKUP($B$4,Planilha1!$A$1:$C$140,3,FALSE),\"cpf não encontrado\"))","v":""}]
[]
[null,"Observação 1: Segundo o edital, notas inferiores a 9 pontos  (30% de 30 pontos) desclassificam o Candidato"]
[null,"Observação 2: A ordem dos 15 alunos classificados para formar a Turma 9 - 2019 será publicada posteriormente neste no site www.profmat.unir.br"]